Reaction Details
TargetMotilin receptor
LigandBDBM50214276
Substrate/Competitorn/a
Meas. Tech.ChEMBL_447562 (CHEMBL896576)
Ki 27±n/a nM
Citation Marsault, EBenakli, KBeaubien, SSaint-Louis, CDéziel, RFraser, G Potent macrocyclic antagonists to the motilin receptor presenting novel unnatural amino acids. Bioorg Med Chem Lett17:4187-90 (2007) 
 
Motilin receptor
Name:Motilin receptor
Type:PROTEIN
Mol. Mass.:45365.95
Organism:Homo sapiens (Human)
Description:ChEMBL_122664
Residue:412
BDBM50214276
NameBDBM50214276
Synonyms:3-[(5R,8R,11S)-5-[(3-chlorophenyl)methyl]-6,9,12-trioxo-8-(propan-2-yl)-3,4,5,6,7,8,9,10,11,12,13,14,15,16-tetradecahydro-2H-1,4,7,10,13-benzoxatetrazacyclooctadecin-11-yl]propanimidamide | CHEMBL234810
TypeSmall organic molecule
Emp. Form.C30H41ClN6O4
Mol. Mass.585.137
SMILESCC(C)[C@H]1NC(=O)[C@@H](Cc2cccc(Cl)c2)NCCOc2ccccc2CCCNC(=O)[C@H](CCC(N)=N)NC1=O