Reaction Details
TargetCasein kinase II subunit alpha
LigandBDBM50214449
Substrate/Competitorn/a
Meas. Tech.ChEMBL_439082 (CHEMBL889430)
Ki 190±n/a nM
Citation Nie, ZPerretta, CErickson, PMargosiak, SAlmassy, RLu, JAverill, AYager, KMChu, S Structure-based design, synthesis, and study of pyrazolo[1,5-a][1,3,5]triazine derivatives as potent inhibitors of protein kinase CK2. Bioorg Med Chem Lett17:4191-5 (2007) 
 
Casein kinase II subunit alpha
Name:Casein kinase II subunit alpha
Type:Enzyme
Mol. Mass.:45151.12
Organism:Homo sapiens (Human)
Description:P68400
Residue:391
BDBM50214449
NameBDBM50214449
Synonyms:CHEMBL398170 | N-(3-(8-cyano-4-(3-(difluoromethoxy)phenylamino)pyrazolo[1,5-a][1,3,5]triazin-2-ylamino)phenyl)acetamide
TypeSmall organic molecule
Emp. Form.C21H16F2N8O2
Mol. Mass.450.4009
SMILESCC(=O)Nc1cccc(Nc2nc(Nc3cccc(OC(F)F)c3)n3ncc(C#N)c3n2)c1