Reaction Details
TargetCasein kinase II subunit alpha
LigandBDBM50214442
Substrate/Competitorn/a
Meas. Tech.ChEMBL_439082 (CHEMBL889430)
Ki 700±n/a nM
Citation Nie, ZPerretta, CErickson, PMargosiak, SAlmassy, RLu, JAverill, AYager, KMChu, S Structure-based design, synthesis, and study of pyrazolo[1,5-a][1,3,5]triazine derivatives as potent inhibitors of protein kinase CK2. Bioorg Med Chem Lett17:4191-5 (2007) 
 
Casein kinase II subunit alpha
Name:Casein kinase II subunit alpha
Type:Enzyme
Mol. Mass.:45151.12
Organism:Homo sapiens (Human)
Description:P68400
Residue:391
BDBM50214442
NameBDBM50214442
Synonyms:CHEMBL397923 | N-(3-(8-cyano-4-(3-(pyrrolidine-1-carbonyl)phenylamino)pyrazolo[1,5-a][1,3,5]triazin-2-ylamino)phenyl)acetamide
TypeSmall organic molecule
Emp. Form.C25H23N9O2
Mol. Mass.481.5092
SMILESCC(=O)Nc1cccc(Nc2nc(Nc3cccc(c3)C(=O)N3CCCC3)n3ncc(C#N)c3n2)c1