Reaction Details
TargetCasein kinase II subunit alpha
LigandBDBM50214459
Substrate/Competitorn/a
Meas. Tech.ChEMBL_439082 (CHEMBL889430)
Ki 168±n/a nM
Citation Nie, ZPerretta, CErickson, PMargosiak, SAlmassy, RLu, JAverill, AYager, KMChu, S Structure-based design, synthesis, and study of pyrazolo[1,5-a][1,3,5]triazine derivatives as potent inhibitors of protein kinase CK2. Bioorg Med Chem Lett17:4191-5 (2007) 
 
Casein kinase II subunit alpha
Name:Casein kinase II subunit alpha
Type:Enzyme
Mol. Mass.:45151.12
Organism:Homo sapiens (Human)
Description:P68400
Residue:391
BDBM50214459
NameBDBM50214459
Synonyms:4-(phenylamino)-2-(pyridin-3-ylamino)pyrazolo[1,5-a][1,3,5]triazine-8-carbonitrile | CHEMBL389604
TypeSmall organic molecule
Emp. Form.C17H12N8
Mol. Mass.328.3308
SMILESN#Cc1cnn2c(Nc3ccccc3)nc(Nc3cccnc3)nc12