Reaction Details
TargetCasein kinase II subunit alpha
LigandBDBM50214472
Substrate/Competitorn/a
Meas. Tech.ChEMBL_439083 (CHEMBL889431)
Ki 260±n/a nM
Citation Nie, ZPerretta, CErickson, PMargosiak, SAlmassy, RLu, JAverill, AYager, KMChu, S Structure-based design, synthesis, and study of pyrazolo[1,5-a][1,3,5]triazine derivatives as potent inhibitors of protein kinase CK2. Bioorg Med Chem Lett17:4191-5 (2007) 
 
Casein kinase II subunit alpha
Name:Casein kinase II subunit alpha
Type:Enzyme
Mol. Mass.:39238.74
Organism:Zea mays (Maize)
Description:n/a
Residue:332
BDBM50214472
NameBDBM50214472
Synonyms:CHEMBL231095 N2,N4-diphenylpyrazolo[1,5-a][1,3,5]triazine-2,4-diamine
TypeSmall organic molecule
Emp. Form.C17H14N6
Mol. Mass.302.3333
SMILESN(c1ccccc1)c1nc(Nc2ccccc2)n2nccc2n1