Reaction Details
TargetCasein kinase II subunit alpha
LigandBDBM50214476
Substrate/Competitorn/a
Meas. Tech.ChEMBL_439082 (CHEMBL889430)
Ki 2000±n/a nM
Citation Nie, ZPerretta, CErickson, PMargosiak, SAlmassy, RLu, JAverill, AYager, KMChu, S Structure-based design, synthesis, and study of pyrazolo[1,5-a][1,3,5]triazine derivatives as potent inhibitors of protein kinase CK2. Bioorg Med Chem Lett17:4191-5 (2007) 
 
Casein kinase II subunit alpha
Name:Casein kinase II subunit alpha
Type:Enzyme
Mol. Mass.:45151.12
Organism:Homo sapiens (Human)
Description:P68400
Residue:391
BDBM50214476
NameBDBM50214476
Synonyms:CHEMBL230569 | N-(3-(4-(cyclopropylamino)-8-ethylpyrazolo[1,5-a][1,3,5]triazin-2-ylamino)phenyl)acetamide
TypeSmall organic molecule
Emp. Form.C18H21N7O
Mol. Mass.351.4056
SMILESCCc1cnn2c(NC3CC3)nc(Nc3cccc(NC(C)=O)c3)nc12