Reaction Details
TargetCasein kinase II subunit alpha
LigandBDBM50214477
Substrate/Competitorn/a
Meas. Tech.ChEMBL_439082 (CHEMBL889430)
Ki 7±n/a nM
Citation Nie, ZPerretta, CErickson, PMargosiak, SAlmassy, RLu, JAverill, AYager, KMChu, S Structure-based design, synthesis, and study of pyrazolo[1,5-a][1,3,5]triazine derivatives as potent inhibitors of protein kinase CK2. Bioorg Med Chem Lett17:4191-5 (2007) 
 
Casein kinase II subunit alpha
Name:Casein kinase II subunit alpha
Type:Enzyme
Mol. Mass.:45151.12
Organism:Homo sapiens (Human)
Description:P68400
Residue:391
BDBM50214477
NameBDBM50214477
Synonyms:4-(phenylamino)-2-(4-(pyridin-2-yl)piperazin-1-yl)pyrazolo[1,5-a][1,3,5]triazine-8-carbonitrile | CHEMBL230246
TypeSmall organic molecule
Emp. Form.C21H19N9
Mol. Mass.397.4359
SMILESN#Cc1cnn2c(Nc3ccccc3)nc(nc12)N1CCN(CC1)c1ccccn1