Reaction Details
TargetCasein kinase II subunit alpha
LigandBDBM50214479
Substrate/Competitorn/a
Meas. Tech.ChEMBL_439082 (CHEMBL889430)
Ki 126±n/a nM
Citation Nie, ZPerretta, CErickson, PMargosiak, SAlmassy, RLu, JAverill, AYager, KMChu, S Structure-based design, synthesis, and study of pyrazolo[1,5-a][1,3,5]triazine derivatives as potent inhibitors of protein kinase CK2. Bioorg Med Chem Lett17:4191-5 (2007) 
 
Casein kinase II subunit alpha
Name:Casein kinase II subunit alpha
Type:Enzyme
Mol. Mass.:45151.12
Organism:Homo sapiens (Human)
Description:P68400
Residue:391
BDBM50214479
NameBDBM50214479
Synonyms:2-(1H-imidazol-1-yl)-4-(phenylamino)pyrazolo[1,5-a][1,3,5]triazine-8-carbonitrile | CHEMBL230135
TypeSmall organic molecule
Emp. Form.C15H10N8
Mol. Mass.302.2935
SMILESN#Cc1cnn2c(Nc3ccccc3)nc(nc12)-n1ccnc1