Reaction Details
TargetPurine nucleoside phosphorylase
LigandBDBM50214707
Substrate/Competitorn/a
Meas. Tech.ChEMBL_447602 (CHEMBL896616)
IC50 20.4±n/a nM
Citation Hikishima, SHashimoto, MMagnowska, LBzowska, AYokomatsu, T Synthesis and biological evaluation of 9-deazaguanine derivatives connected by a linker to difluoromethylene phosphonic acid as multi-substrate analogue inhibitors of PNP. Bioorg Med Chem Lett17:4173-7 (2007) 
 
Purine nucleoside phosphorylase
Name:Purine nucleoside phosphorylase
Type:Enzyme
Mol. Mass.:32119.53
Organism:Homo sapiens (Human)
Description:n/a
Residue:289
BDBM50214707
NameBDBM50214707
Synonyms:9-(5',5'-Difluoro-5'-phosphonopentyl)-9-deazaguanine | CHEMBL236709
TypeSmall organic molecule
Emp. Form.C11H15F2N4O4P
Mol. Mass.336.2318
SMILESNc1nc2c(CCCCC(F)(F)P(O)(O)=O)c[nH]c2c(=O)[nH]1