Reaction Details
TargetPurine nucleoside phosphorylase
LigandBDBM50214705
Substrate/Competitorn/a
Meas. Tech.ChEMBL_447605 (CHEMBL896619)
Ki 2.7±n/a nM
Citation Hikishima, SHashimoto, MMagnowska, LBzowska, AYokomatsu, T Synthesis and biological evaluation of 9-deazaguanine derivatives connected by a linker to difluoromethylene phosphonic acid as multi-substrate analogue inhibitors of PNP. Bioorg Med Chem Lett17:4173-7 (2007) 
 
Purine nucleoside phosphorylase
Name:Purine nucleoside phosphorylase
Type:Enzyme
Mol. Mass.:32035.18
Organism:Bos taurus (bovine)
Description:n/a
Residue:289
BDBM50214705
NameBDBM50214705
Synonyms:5-(2-amino-6-oxo-1,6-dihydro-9H-purin-9-yl)-1,1-difluoropentylphosphonate 9-(5,5-DIFLUORO-5-PHOSPHONOPENTYL)GUANINE [5-(2-Amino-6-oxo-1,6-dihydro-purin-9-yl)-1,1-difluoro-pentyl]-phosphonic acid
TypeSmall organic molecule
Emp. Form.C10H14F2N5O4P
Mol. Mass.337.2198
SMILESNc1nc2n(CCCCC(F)(F)P(O)(O)=O)cnc2c(=O)[nH]1