Reaction Details
TargetGlucocorticoid receptor
LigandBDBM50214933
Substrate/Competitorn/a
Meas. Tech.ChEMBL_447642 (CHEMBL896649)
Ki 1.6±n/a nM
Citation Ardecky, RJHudson, ARPhillips, DPTyhonas, JSDeckhut, CLau, TLLi, YMartinborough, EARoach, SLHiguchi, RILopez, FJMarschke, KBMiner, JNKaranewsky, DSNegro-Vilar, AZhi, L 5(Z)-benzylidene-1,2-dihydro-9-hydroxy-10-methoxy-2,2,4-trimethyl-5H-1-aza-6-oxa-chrysenes as non-steroidal glucocorticoid receptor modulators. Bioorg Med Chem Lett17:4158-62 (2007) 
 
Glucocorticoid receptor
Name:Glucocorticoid receptor
Type:Enzyme
Mol. Mass.:85656.87
Organism:Homo sapiens (Human)
Description:P04150
Residue:777
BDBM50214933
NameBDBM50214933
Synonyms:(Z)-10-methoxy-2,2,4-trimethyl-5-((6-methylpyridin-2-yl)methylene)-2,4a,5,12a-tetrahydro-1H-chromeno[3,4-f]quinolin-9-ol | CHEMBL232762
TypeSmall organic molecule
Emp. Form.C27H28N2O3
Mol. Mass.428.5228
SMILESCOc1c(O)ccc2O\C(=C/c3cccc(C)n3)C3=C(C=CC4NC(C)(C)C=C(C)C34)c12