Reaction Details
TargetGlucocorticoid receptor
LigandBDBM50214935
Substrate/Competitorn/a
Meas. Tech.ChEMBL_447642 (CHEMBL896649)
Ki 1.5±n/a nM
Citation Ardecky, RJHudson, ARPhillips, DPTyhonas, JSDeckhut, CLau, TLLi, YMartinborough, EARoach, SLHiguchi, RILopez, FJMarschke, KBMiner, JNKaranewsky, DSNegro-Vilar, AZhi, L 5(Z)-benzylidene-1,2-dihydro-9-hydroxy-10-methoxy-2,2,4-trimethyl-5H-1-aza-6-oxa-chrysenes as non-steroidal glucocorticoid receptor modulators. Bioorg Med Chem Lett17:4158-62 (2007) 
 
Glucocorticoid receptor
Name:Glucocorticoid receptor
Type:Enzyme
Mol. Mass.:85656.87
Organism:Homo sapiens (Human)
Description:P04150
Residue:777
BDBM50214935
NameBDBM50214935
Synonyms:5-fluoro-2-((Z)-(9-hydroxy-10-methoxy-2,2,4-trimethyl-1,2-dihydro-4aH-chromeno[3,4-f]quinolin-5(12aH)-ylidene)methyl)benzaldehyde oxime | CHEMBL232390
TypeSmall organic molecule
Emp. Form.C28H27FN2O4
Mol. Mass.474.5234
SMILESCOc1c(O)ccc2OC(=Cc3ccc(F)cc3CN=O)C3=C(C=CC4NC(C)(C)C=C(C)C34)c12