Reaction Details
TargetPeroxisome proliferator-activated receptor alpha
LigandBDBM28661
Substrate/Competitorn/a
Meas. Tech.ChEMBL_447647 (CHEMBL896654)
EC50 3900±n/a nM
Citation Havranek, MSauerberg, PMogensen, JPKratina, PJeppesen, CBPettersson, IPihera, P Novel selective PPARdelta agonists: optimization of activity by modification of alkynylallylic moiety. Bioorg Med Chem Lett17:4144-9 (2007) 
 
Peroxisome proliferator-activated receptor alpha
Name:Peroxisome proliferator-activated receptor alpha
Type:Enzyme
Mol. Mass.:52222.08
Organism:Homo sapiens (Human)
Description:Q07869
Residue:468
BDBM28661
NameBDBM28661
Synonyms:2-{2-methyl-4-[({4-methyl-2-[4-(trifluoromethyl)phenyl]-1,3-thiazol-5-yl}methyl)sulfanyl]phenoxy}acetic acid GW 501516 GW1516 | GW501516
TypeSmall organic molecule
Emp. Form.C21H18F3NO3S2
Mol. Mass.453.498
SMILESCc1nc(sc1CSc1ccc(OCC(O)=O)c(C)c1)-c1ccc(cc1)C(F)(F)F