Reaction Details
TargetHistone deacetylase 1
LigandBDBM50215008
Substrate/Competitorn/a
Meas. Tech.ChEMBL_456402 (CHEMBL907491)
IC50 5±n/a nM
Citation Siliphaivanh, PHarrington, PWitter, DJOtte, KTempest, PKattar, SKral, AMFleming, JCDeshmukh, SVHarsch, ASecrist, PJMiller, TA Design of novel histone deacetylase inhibitors. Bioorg Med Chem Lett17:4619-24 (2007) 
 
Histone deacetylase 1
Name:Histone deacetylase 1
Type:Enzyme
Mol. Mass.:55090.27
Organism:Homo sapiens (Human)
Description:Q13547
Residue:482
BDBM50215008
NameBDBM50215008
Synonyms:4-(1,3-dioxo-1,3-bis(phenylamino)propan-2-yl)-N-hydroxybenzamide | CHEMBL250946
TypeSmall organic molecule
Emp. Form.C22H19N3O4
Mol. Mass.389.404
SMILESONC(=O)c1ccc(cc1)C(C(=O)Nc1ccccc1)C(=O)Nc1ccccc1