Reaction Details
TargetProthrombin
LigandBDBM50215426
Substrate/Competitorn/a
Meas. Tech.ChEMBL_439444 (CHEMBL888564)
IC50>100000±n/a nM
Citation Trujillo, JIHuang, HCNeumann, WLMahoney, MWLong, SHuang, WGarland, DJKusturin, CAbbas, ZSouth, MSReitz, DB Design, synthesis, and biological evaluation of pyrazinones containing novel P1 needles as inhibitors of TF/VIIa. Bioorg Med Chem Lett17:4568-74 (2007) 
 
Prothrombin
Name:Prothrombin
Type:Protein
Mol. Mass.:70029.57
Organism:Homo sapiens (Human)
Description:P00734
Residue:622
BDBM50215426
NameBDBM50215426
Synonyms:2-[6-(3-aminophenyl)-5-chloro-3-(cyclobutylamino)-2-oxo-1,2-dihydropyrazin-1-yl]-N-[(4-carbamimidoyl-2,5,6-trifluoro-3-hydroxyphenyl)methyl]acetamide | CHEMBL230661
TypeSmall organic molecule
Emp. Form.C24H23ClF3N7O3
Mol. Mass.549.933
SMILESNC(=N)c1c(O)c(F)c(CNC(=O)Cn2c(c(Cl)nc(NC3CCC3)c2=O)-c2cccc(N)c2)c(F)c1F