Reaction Details
TargetMAP kinase-activated protein kinase 5
LigandBDBM50215497
Substrate/Competitorn/a
Meas. Tech.ChEMBL_456530 (CHEMBL922896)
IC50 25000±n/a nM
Citation Trujillo, JIMeyers, MJAnderson, DRHegde, SMahoney, MWVernier, WFBuchler, IPWu, KKYang, SYang, SHartmann, SJReitz, DB Novel tetrahydro-beta-carboline-1-carboxylic acids as inhibitors of mitogen activated protein kinase-activated protein kinase 2 (MK-2). Bioorg Med Chem Lett17:4657-63 (2007) 
 
MAP kinase-activated protein kinase 5
Name:MAP kinase-activated protein kinase 5
Type:Serine/threonine-protein kinase
Mol. Mass.:54229.92
Organism:Homo sapiens (Human)
Description:Recombinant MAPKAPK5 was phosphorylated by incubation with active p38alpha before assays.
Residue:473
BDBM50215497
NameBDBM50215497
Synonyms:5-methoxy-9,12-diazatetracyclo[10.3.1.0^{2,10}.0^{3,8}]hexadeca-2(10),3,5,7-tetraene-11-carboxylic acid | CHEMBL394124
TypeSmall organic molecule
Emp. Form.C16H18N2O3
Mol. Mass.286.3257
SMILESCOc1ccc2[nH]c3C(N4CCCC(C4)c3c2c1)C(O)=O