Reaction Details
TargetMAP kinase-activated protein kinase 2
LigandBDBM50215488
Substrate/Competitorn/a
Meas. Tech.ChEMBL_456523 (CHEMBL922889)
IC50 13000±n/a nM
Citation Trujillo, JIMeyers, MJAnderson, DRHegde, SMahoney, MWVernier, WFBuchler, IPWu, KKYang, SYang, SHartmann, SJReitz, DB Novel tetrahydro-beta-carboline-1-carboxylic acids as inhibitors of mitogen activated protein kinase-activated protein kinase 2 (MK-2). Bioorg Med Chem Lett17:4657-63 (2007) 
 
MAP kinase-activated protein kinase 2
Name:MAP kinase-activated protein kinase 2
Type:Serine/threonine-protein kinase
Mol. Mass.:45579.87
Organism:Homo sapiens (Human)
Description:P49137
Residue:400
BDBM50215488
NameBDBM50215488
Synonyms:1-phenylethyl 5-methoxy-9,12-diazatetracyclo[10.2.1.0^{2,10}.0^{3,8}]pentadeca-2(10),3,5,7-tetraene-11-carboxylate | CHEMBL395352
TypeSmall organic molecule
Emp. Form.C23H24N2O3
Mol. Mass.376.4483
SMILESCOc1ccc2[nH]c3C(N4CCC(C4)c3c2c1)C(=O)OC(C)c1ccccc1