Reaction Details
TargetMAP kinase-activated protein kinase 2
LigandBDBM50215514
Substrate/Competitorn/a
Meas. Tech.ChEMBL_456523 (CHEMBL922889)
IC50>200000±n/a nM
Citation Trujillo, JIMeyers, MJAnderson, DRHegde, SMahoney, MWVernier, WFBuchler, IPWu, KKYang, SYang, SHartmann, SJReitz, DB Novel tetrahydro-beta-carboline-1-carboxylic acids as inhibitors of mitogen activated protein kinase-activated protein kinase 2 (MK-2). Bioorg Med Chem Lett17:4657-63 (2007) 
 
MAP kinase-activated protein kinase 2
Name:MAP kinase-activated protein kinase 2
Type:Serine/threonine-protein kinase
Mol. Mass.:45579.87
Organism:Homo sapiens (Human)
Description:P49137
Residue:400
BDBM50215514
NameBDBM50215514
Synonyms:(6-methoxy-2,3,4,9-tetrahydro-1H-pyrido[3,4-b]indol-1-yl)methanamine | CHEMBL245705
TypeSmall organic molecule
Emp. Form.C13H17N3O
Mol. Mass.231.2936
SMILESCOc1ccc2[nH]c3C(CN)NCCc3c2c1