Reaction Details
TargetMAP kinase-activated protein kinase 2
LigandBDBM50215513
Substrate/Competitorn/a
Meas. Tech.ChEMBL_456523 (CHEMBL922889)
IC50 12000±n/a nM
Citation Trujillo, JIMeyers, MJAnderson, DRHegde, SMahoney, MWVernier, WFBuchler, IPWu, KKYang, SYang, SHartmann, SJReitz, DB Novel tetrahydro-beta-carboline-1-carboxylic acids as inhibitors of mitogen activated protein kinase-activated protein kinase 2 (MK-2). Bioorg Med Chem Lett17:4657-63 (2007) 
 
MAP kinase-activated protein kinase 2
Name:MAP kinase-activated protein kinase 2
Type:Serine/threonine-protein kinase
Mol. Mass.:45579.87
Organism:Homo sapiens (Human)
Description:P49137
Residue:400
BDBM50215513
NameBDBM50215513
Synonyms:6-(benzyloxy)-2,3,4,9-tetrahydro-1H-pyrido[3,4-b]indole-1-carboxylic acid | CHEMBL396314
TypeSmall organic molecule
Emp. Form.C19H18N2O3
Mol. Mass.322.3578
SMILESOC(=O)C1NCCc2c1[nH]c1ccc(OCc3ccccc3)cc21