Reaction Details
TargetAndrogen receptor
LigandBDBM50215709
Substrate/Competitorn/a
Meas. Tech.ChEMBL_447721 (CHEMBL896729)
EC50 2.8±n/a nM
Citation Manfredi, MCBi, YNirschl, AASutton, JCSeethala, RGolla, RBeehler, BCSleph, PGGrover, GJOstrowski, JHamann, LG Synthesis and SAR of tetrahydropyrrolo[1,2-b][1,2,5]thiadiazol-2(3H)-one 1,1-dioxide analogues as highly potent selective androgen receptor modulators. Bioorg Med Chem Lett17:4487-90 (2007) 
 
Androgen receptor
Name:Androgen receptor
Type:PROTEIN
Mol. Mass.:98196.62
Organism:Mus musculus
Description:ChEMBL_945930
Residue:899
BDBM50215709
NameBDBM50215709
Synonyms:CHEMBL1170 Propionic acid 10,13-dimethyl-3-oxo-2,3,6,7,8,9,10,11,12,13,14,15,16,17-tetradecahydro-1H-cyclopenta[a]phenanthren-17-yl ester TESTOSTERONE PROPIONATE | testosteron propionate
TypeSmall organic molecule
Emp. Form.C22H32O3
Mol. Mass.344.4877
SMILESCCC(=O)O[C@H]1CC[C@H]2[C@@H]3CCC4=CC(=O)CC[C@]4(C)[C@H]3CC[C@]12C