Reaction Details
TargetAndrogen receptor
LigandBDBM50215711
Substrate/Competitorn/a
Meas. Tech.ChEMBL_447720 (CHEMBL896728)
Ki 44±n/a nM
Citation Manfredi, MCBi, YNirschl, AASutton, JCSeethala, RGolla, RBeehler, BCSleph, PGGrover, GJOstrowski, JHamann, LG Synthesis and SAR of tetrahydropyrrolo[1,2-b][1,2,5]thiadiazol-2(3H)-one 1,1-dioxide analogues as highly potent selective androgen receptor modulators. Bioorg Med Chem Lett17:4487-90 (2007) 
 
Androgen receptor
Name:Androgen receptor
Type:Receptor
Mol. Mass.:99185.27
Organism:Homo sapiens (Human)
Description:CHO cells were stably transfected with human AR gene.
Residue:920
BDBM50215711
NameBDBM50215711
Synonyms:2-chloro-4-((3aS,5S)-5-hydroxy-1,1,3-trioxo-tetrahydro-1lambda6-thia-2,6a-diaza-pentalen-2-yl)-3-methyl-benzonitrile | CHEMBL391769
TypeSmall organic molecule
Emp. Form.C13H12ClN3O4S
Mol. Mass.341.77
SMILESCc1c(Cl)c(ccc1N1C(=O)[C@@H]2C[C@H](O)CN2S1(=O)=O)C#N