Reaction Details
TargetAndrogen receptor
LigandBDBM50215718
Substrate/Competitorn/a
Meas. Tech.ChEMBL_447720 (CHEMBL896728)
Ki 36±n/a nM
Citation Manfredi, MCBi, YNirschl, AASutton, JCSeethala, RGolla, RBeehler, BCSleph, PGGrover, GJOstrowski, JHamann, LG Synthesis and SAR of tetrahydropyrrolo[1,2-b][1,2,5]thiadiazol-2(3H)-one 1,1-dioxide analogues as highly potent selective androgen receptor modulators. Bioorg Med Chem Lett17:4487-90 (2007) 
 
Androgen receptor
Name:Androgen receptor
Type:Receptor
Mol. Mass.:99185.27
Organism:Homo sapiens (Human)
Description:CHO cells were stably transfected with human AR gene.
Residue:920
BDBM50215718
NameBDBM50215718
Synonyms:(2S,3R)-methyl 1-(3-chloro-4-cyano-2-methylphenylsulfonyl)-3-hydroxypyrrolidine-2-carboxylate | CHEMBL234394
TypeSmall organic molecule
Emp. Form.C14H15ClN2O5S
Mol. Mass.358.797
SMILESCOC(=O)[C@@H]1[C@H](O)CCN1S(=O)(=O)c1ccc(C#N)c(Cl)c1C