Reaction Details
TargetVascular endothelial growth factor receptor 2
LigandBDBM50215745
Substrate/Competitorn/a
Meas. Tech.ChEMBL_456542 (CHEMBL922908)
IC50 1350±n/a nM
Citation Lin, RChiu, GYu, YConnolly, PJLi, SLu, YAdams, MFuentes-Pesquera, AREmanuel, SLGreenberger, LM Design, synthesis, and evaluation of 3,4-disubstituted pyrazole analogues as anti-tumor CDK inhibitors. Bioorg Med Chem Lett17:4557-61 (2007) 
 
Vascular endothelial growth factor receptor 2
Name:Vascular endothelial growth factor receptor 2
Type:Receptor Tyrosine Kinase
Mol. Mass.:151510.97
Organism:Homo sapiens (Human)
Description:P35968
Residue:1356
BDBM50215745
NameBDBM50215745
Synonyms:CHEMBL245966 | N-ethyl-5-(2-(3-(6-methoxy-1H-benzo[d]imidazol-2-yl)-1H-pyrazol-4-yl)vinyl)nicotinamide
TypeSmall organic molecule
Emp. Form.C21H20N6O2
Mol. Mass.388.4225
SMILESCCNC(=O)c1cncc(C=Cc2c[nH]nc2-c2nc3ccc(OC)cc3[nH]2)c1