Reaction Details
TargetVascular endothelial growth factor receptor 2
LigandBDBM50215748
Substrate/Competitorn/a
Meas. Tech.ChEMBL_456542 (CHEMBL922908)
IC50 10000±n/a nM
Citation Lin, RChiu, GYu, YConnolly, PJLi, SLu, YAdams, MFuentes-Pesquera, AREmanuel, SLGreenberger, LM Design, synthesis, and evaluation of 3,4-disubstituted pyrazole analogues as anti-tumor CDK inhibitors. Bioorg Med Chem Lett17:4557-61 (2007) 
 
Vascular endothelial growth factor receptor 2
Name:Vascular endothelial growth factor receptor 2
Type:Receptor Tyrosine Kinase
Mol. Mass.:151510.97
Organism:Homo sapiens (Human)
Description:P35968
Residue:1356
BDBM50215748
NameBDBM50215748
Synonyms:CHEMBL245376 | N-((5-(2-(3-(4-(trifluoromethyl)-1H-imidazol-2-yl)-1H-pyrazol-4-yl)vinyl)pyridin-3-yl)methyl)ethanamine
TypeSmall organic molecule
Emp. Form.C17H17F3N6
Mol. Mass.362.3523
SMILESCCNCc1cncc(C=Cc2c[nH]nc2-c2ncc([nH]2)C(F)(F)F)c1