Reaction Details
TargetAurora kinase A
LigandBDBM50215751
Substrate/Competitorn/a
Meas. Tech.ChEMBL_456543 (CHEMBL922909)
IC50>10000±n/a nM
Citation Lin, RChiu, GYu, YConnolly, PJLi, SLu, YAdams, MFuentes-Pesquera, AREmanuel, SLGreenberger, LM Design, synthesis, and evaluation of 3,4-disubstituted pyrazole analogues as anti-tumor CDK inhibitors. Bioorg Med Chem Lett17:4557-61 (2007) 
 
Aurora kinase A
Name:Aurora kinase A
Type:Serine/threonine-protein kinase
Mol. Mass.:45830.98
Organism:Homo sapiens (Human)
Description:O14965
Residue:403
BDBM50215751
NameBDBM50215751
Synonyms:2-(4-(2-(pyridin-3-yl)vinyl)-1H-pyrazol-3-yl)-1H-imidazole-4-carbonitrile | CHEMBL394466
TypeSmall organic molecule
Emp. Form.C14H10N6
Mol. Mass.262.2694
SMILESN#Cc1cnc([nH]1)-c1n[nH]cc1C=Cc1cccnc1