Reaction Details
TargetSerine/threonine-protein kinase B-raf
LigandBDBM50215770
Substrate/Competitorn/a
Meas. Tech.ChEMBL_456553 (CHEMBL922919)
IC50 824±n/a nM
Citation Wickens, PKluender, HDixon, JBrennan, CAchebe, FBacchiocchi, ABankston, DBierer, DBrands, MBraun, DBrown, MSChuang, CYDumas, JEnyedy, IHofilena, GHong, ZHousley, TJones, BKhire, UKreiman, CKumarasinghe, ELowinger, TOtt-Morgan, RPerkins, LPhillips, BSchoenleber, RScott, WJSheeler, RRedman, ASun, XTaylor, IWang, LWilhelm, SZhang, XZhang, MSullivan, ECarter, CMiglarese, MLevy, J SAR of a novel 'Anthranilamide Like' series of VEGFR-2, multi protein kinase inhibitors for the treatment of cancer. Bioorg Med Chem Lett17:4378-81 (2007) 
 
Serine/threonine-protein kinase B-raf
Name:Serine/threonine-protein kinase B-raf
Type:Serine/threonine-protein kinase
Mol. Mass.:84446.00
Organism:Homo sapiens (Human)
Description:P15056
Residue:766
BDBM50215770
NameBDBM50215770
Synonyms:1-(5-((5-((2,2-difluorobenzo[d][1,3]dioxol-5-yl)carbamoyl)thiazol-4-ylamino)methyl)pyridin-2-yl)-3-ethylurea | CHEMBL247798
TypeSmall organic molecule
Emp. Form.C20H18F2N6O4S
Mol. Mass.476.457
SMILESCCNC(=O)Nc1ccc(CNc2ncsc2C(=O)Nc2ccc3OC(F)(F)Oc3c2)cn1