Reaction Details
TargetHistone deacetylase 1
LigandBDBM50216017
Substrate/Competitorn/a
Meas. Tech.ChEMBL_456584 (CHEMBL923961)
IC50 205±n/a nM
Citation Witter, DJBelvedere, SChen, LSecrist, JPMosley, RTMiller, TA Benzo[b]thiophene-based histone deacetylase inhibitors. Bioorg Med Chem Lett17:4562-7 (2007) 
 
Histone deacetylase 1
Name:Histone deacetylase 1
Type:Enzyme
Mol. Mass.:55090.27
Organism:Homo sapiens (Human)
Description:Q13547
Residue:482
BDBM50216017
NameBDBM50216017
Synonyms:6-benzamido-N-hydroxybenzo[b]thiophene-2-carboxamide | CHEMBL245556
TypeSmall organic molecule
Emp. Form.C16H12N2O3S
Mol. Mass.312.343
SMILESONC(=O)c1cc2ccc(NC(=O)c3ccccc3)cc2s1