Reaction Details
TargetMembrane-bound transcription factor site-1 protease
LigandBDBM50216180
Substrate/Competitorn/a
Meas. Tech.ChEMBL_447771 (CHEMBL896780)
IC50 37±n/a nM
Citation Hay, BAAbrams, BZumbrunn, AYValentine, JJWarren, LCPetras, SFShelly, LDXia, AVarghese, AHHawkins, JLVan Camp, JARobbins, MDLandschulz, KHarwood, HJ Aminopyrrolidineamide inhibitors of site-1 protease. Bioorg Med Chem Lett17:4411-4 (2007) 
 
Membrane-bound transcription factor site-1 protease
Name:Membrane-bound transcription factor site-1 protease
Type:PROTEIN
Mol. Mass.:117773.36
Organism:Homo sapiens (Human)
Description:ChEMBL_641529
Residue:1052
BDBM50216180
NameBDBM50216180
Synonyms:CHEMBL233799 | N-(2-methoxyphenethyl)-N-(pyrrolidin-3-yl)-4-((3-o-tolylpiperidin-1-yl)methyl)benzamide
TypeSmall organic molecule
Emp. Form.C33H41N3O2
Mol. Mass.511.6975
SMILESCOc1ccccc1CCN(C1CCNC1)C(=O)c1ccc(CN2CCCC(C2)c2ccccc2C)cc1