Reaction Details
TargetReceptor-type tyrosine-protein kinase FLT3
LigandBDBM50217353
Substrate/Competitorn/a
Meas. Tech.ChEMBL_448611 (CHEMBL897762)
IC50 62±n/a nM
Citation Gaul, MDXu, GKirkpatrick, JOtt, HBaumann, CA 4-Amino-6-piperazin-1-yl-pyrimidine-5-carbaldehyde oximes as potent FLT-3 inhibitors. Bioorg Med Chem Lett17:4861-5 (2007) 
 
Receptor-type tyrosine-protein kinase FLT3
Name:Receptor-type tyrosine-protein kinase FLT3
Type:Enzyme
Mol. Mass.:112888.62
Organism:Homo sapiens (Human)
Description:P36888
Residue:993
BDBM50217353
NameBDBM50217353
Synonyms:(E)-4-(6-amino-5-((2-morpholino-2-oxoethoxyimino)methyl)pyrimidin-4-yl)-N-(4-isopropoxyphenyl)piperazine-1-carboxamide | CHEMBL237340
TypeSmall organic molecule
Emp. Form.C25H34N8O5
Mol. Mass.526.5881
SMILESCC(C)Oc1ccc(NC(=O)N2CCN(CC2)c2ncnc(N)c2\C=N\OCC(=O)N2CCOCC2)cc1