Reaction Details
TargetMast/stem cell growth factor receptor Kit
LigandBDBM50217360
Substrate/Competitorn/a
Meas. Tech.ChEMBL_448614 (CHEMBL897765)
IC50 10500±n/a nM
Citation Gaul, MDXu, GKirkpatrick, JOtt, HBaumann, CA 4-Amino-6-piperazin-1-yl-pyrimidine-5-carbaldehyde oximes as potent FLT-3 inhibitors. Bioorg Med Chem Lett17:4861-5 (2007) 
 
Mast/stem cell growth factor receptor Kit
Name:Mast/stem cell growth factor receptor Kit
Type:Protein
Mol. Mass.:109869.37
Organism:Homo sapiens (Human)
Description:P10721
Residue:976
BDBM50217360
NameBDBM50217360
Synonyms:4-(6-amino-5-((methoxyimino)methyl)pyrimidin-4-yl)-N-(4-isopropoxyphenyl)piperazine-1-carboxamide | CHEMBL269594
TypeSmall organic molecule
Emp. Form.C20H27N7O3
Mol. Mass.413.4735
SMILESCO\N=C\c1c(N)ncnc1N1CCN(CC1)C(=O)Nc1ccc(OC(C)C)cc1