Reaction Details
TargetReceptor-type tyrosine-protein kinase FLT3
LigandBDBM50217362
Substrate/Competitorn/a
Meas. Tech.ChEMBL_448611 (CHEMBL897762)
IC50 18±n/a nM
Citation Gaul, MDXu, GKirkpatrick, JOtt, HBaumann, CA 4-Amino-6-piperazin-1-yl-pyrimidine-5-carbaldehyde oximes as potent FLT-3 inhibitors. Bioorg Med Chem Lett17:4861-5 (2007) 
 
Receptor-type tyrosine-protein kinase FLT3
Name:Receptor-type tyrosine-protein kinase FLT3
Type:Enzyme
Mol. Mass.:112888.62
Organism:Homo sapiens (Human)
Description:P36888
Residue:993
BDBM50217362
NameBDBM50217362
Synonyms:4-(6-amino-5-((methoxyimino)methyl)pyrimidin-4-yl)-N-(6-(cyclopentyloxy)pyridin-3-yl)piperazine-1-carboxamide | CHEMBL238223
TypeSmall organic molecule
Emp. Form.C21H28N8O3
Mol. Mass.440.4988
SMILESCO\N=C\c1c(N)ncnc1N1CCN(CC1)C(=O)Nc1ccc(OC2CCCC2)nc1