Reaction Details
TargetIntegrin alpha-5/beta-1
LigandBDBM50217423
Substrate/Competitorn/a
Meas. Tech.ChEMBL_444670 (CHEMBL894919)
IC50 1.7±n/a nM
Citation Stragies, ROsterkamp, FZischinsky, GVossmeyer, DKalkhof, HReimer, UZahn, G Design and synthesis of a new class of selective integrin alpha5beta1 antagonists. J Med Chem50:3786-94 (2007) 
 
Integrin alpha-5/beta-1
Name:Integrin alpha-5/beta-1
Type:Enzyme
Mol. Mass.:n/a
Description:n/a
Components:This complex has 2 components.
Component 1
Name:Integrin alpha-5
Synonyms:CD49 antigen-like family member E FNRA Fibronectin receptor subunit alpha ITGA5 Integrin alpha-F | VLA-5
Type:Single-pass type I membrane protein
Mol. Mass.:114523.00
Organism:Homo sapiens (Human)
Description:n/a
Residue:1049
Component 2
Name:Integrin beta-1
Synonyms:CD_antigen=CD29 Fibronectin receptor beta GPIIA ITGB1 MDF2 | MSK12
Type:Enzyme
Mol. Mass.:88400.38
Organism:Homo sapiens (Human)
Description:P05556
Residue:798
BDBM50217423
NameBDBM50217423
Synonyms:2S,4R,20S-4-({2-carboxy-2-[(1-methyl-cyclohexanecarbonyl)-amino]-ethylcarbamoyl}-methoxy)-2-(pyridin-2-ylaminomethyl)-pyrrolidine-1-carboxylic acid benzyl ester | CHEMBL243949
TypeSmall organic molecule
Emp. Form.C31H41N5O7
Mol. Mass.595.6865
SMILESCC1(CCCCC1)C(=O)N[C@@H](CNC(=O)CO[C@@H]1C[C@@H](CNc2ccccn2)N(C1)C(=O)OCc1ccccc1)C(O)=O