Reaction Details
TargetSodium-dependent serotonin transporter
LigandBDBM50217568
Substrate/Competitorn/a
Meas. Tech.ChEMBL_448651 (CHEMBL897802)
Ki 1±n/a nM
Citation Letavic, MAStocking, EMBarbier, AJBonaventure, PBoggs, JDLord, BMiller, KLWilson, SJCarruthers, NI Benzylamine histamine H(3) antagonists and serotonin reuptake inhibitors. Bioorg Med Chem Lett17:4799-803 (2007) 
 
Sodium-dependent serotonin transporter
Name:Sodium-dependent serotonin transporter
Type:Multi-pass membrane protein
Mol. Mass.:70168.43
Organism:Rattus norvegicus (rat)
Description:P31652
Residue:630
BDBM50217568
NameBDBM50217568
Synonyms:1-isopropyl-4-(4-(3-((methylamino)methyl)-4-(4-(methylthio)phenoxy)phenyl)but-3-ynyl)piperazin-2-one | CHEMBL393009
TypeSmall organic molecule
Emp. Form.C26H33N3O2S
Mol. Mass.451.624
SMILESCNCc1cc(ccc1Oc1ccc(SC)cc1)C#CCCN1CCN(C(C)C)C(=O)C1