Reaction Details
TargetSodium-dependent serotonin transporter
LigandBDBM50217586
Substrate/Competitorn/a
Meas. Tech.ChEMBL_448651 (CHEMBL897802)
Ki 0.3±n/a nM
Citation Letavic, MAStocking, EMBarbier, AJBonaventure, PBoggs, JDLord, BMiller, KLWilson, SJCarruthers, NI Benzylamine histamine H(3) antagonists and serotonin reuptake inhibitors. Bioorg Med Chem Lett17:4799-803 (2007) 
 
Sodium-dependent serotonin transporter
Name:Sodium-dependent serotonin transporter
Type:Multi-pass membrane protein
Mol. Mass.:70168.43
Organism:Rattus norvegicus (rat)
Description:P31652
Residue:630
BDBM50217586
NameBDBM50217586
Synonyms:CHEMBL442080 | N-(4-(3-((methylamino)methyl)-4-(4-(methylthio)phenoxy)phenyl)but-3-ynyl)cyclopropanamine
TypeSmall organic molecule
Emp. Form.C22H26N2OS
Mol. Mass.366.52
SMILESCNCc1cc(ccc1Oc1ccc(SC)cc1)C#CCCNC1CC1