Reaction Details
TargetSodium-dependent serotonin transporter
LigandBDBM50217579
Substrate/Competitorn/a
Meas. Tech.ChEMBL_448652 (CHEMBL897803)
Ki 0.9±n/a nM
Citation Letavic, MAStocking, EMBarbier, AJBonaventure, PBoggs, JDLord, BMiller, KLWilson, SJCarruthers, NI Benzylamine histamine H(3) antagonists and serotonin reuptake inhibitors. Bioorg Med Chem Lett17:4799-803 (2007) 
 
Sodium-dependent serotonin transporter
Name:Sodium-dependent serotonin transporter
Type:Multi-pass membrane protein
Mol. Mass.:70322.51
Organism:Homo sapiens (Human)
Description:P31645
Residue:630
BDBM50217579
NameBDBM50217579
Synonyms:(5-(4-(4-fluoropiperidin-1-yl)but-1-ynyl)-2-(4-(methylthio)phenoxy)phenyl)-N-methylmethanamine | CHEMBL391074
TypeSmall organic molecule
Emp. Form.C24H29FN2OS
Mol. Mass.412.563
SMILESCNCc1cc(ccc1Oc1ccc(SC)cc1)C#CCCN1CCC(F)CC1