Reaction Details
TargetMu-type opioid receptor
LigandBDBM50067447
Substrate/Competitorn/a
Meas. Tech.ChEMBL_444756 (CHEMBL895003)
Ki 3.1±n/a nM
Citation Hiebel, ACLee, YSBilsky, EGiuvelis, DDeschamps, JRParrish, DAAceto, MDMay, ELHarris, LSCoop, ADersch, CMPartilla, JSRothman, RBCheng, KJacobson, AERice, KC Probes for narcotic receptor mediated phenomena. 34. Synthesis and structure-activity relationships of a potent mu-agonist delta-antagonist and an exceedingly potent antinociceptive in the enantiomeric C9-substituted 5-(3-hydroxyphenyl)-N-phenylethylmorphan series. J Med Chem50:3765-76 (2007) 
 
Mu-type opioid receptor
Name:Mu-type opioid receptor
Type:G Protein-Coupled Receptor (GPCR)
Mol. Mass.:44789.51
Organism:Homo sapiens (Human)
Description:P35372
Residue:400
BDBM50067447
NameBDBM50067447
Synonyms:3-((R)-9-Methyl-2-phenethyl-2-aza-bicyclo[3.3.1]non-5-yl)-phenol | CHEMBL334898
TypeSmall organic molecule
Emp. Form.C23H29NO
Mol. Mass.335.4825
SMILESC[C@H]1C2CCCC1(CCN2CCc1ccccc1)c1cccc(O)c1