Reaction Details
TargetKappa-type opioid receptor
LigandBDBM50217951
Substrate/Competitorn/a
Meas. Tech.ChEMBL_444758 (CHEMBL895005)
Ki 235±n/a nM
Citation Hiebel, ACLee, YSBilsky, EGiuvelis, DDeschamps, JRParrish, DAAceto, MDMay, ELHarris, LSCoop, ADersch, CMPartilla, JSRothman, RBCheng, KJacobson, AERice, KC Probes for narcotic receptor mediated phenomena. 34. Synthesis and structure-activity relationships of a potent mu-agonist delta-antagonist and an exceedingly potent antinociceptive in the enantiomeric C9-substituted 5-(3-hydroxyphenyl)-N-phenylethylmorphan series. J Med Chem50:3765-76 (2007) 
 
Kappa-type opioid receptor
Name:Kappa-type opioid receptor
Type:G Protein-Coupled Receptor (GPCR)
Mol. Mass.:42648.76
Organism:Homo sapiens (Human)
Description:P41145
Residue:380
BDBM50217951
NameBDBM50217951
Synonyms:(1S,5S,9R)-(+)-9-hydroxy-5-(3-hydroxyphenyl-2-phenylethyl-2-azabicyclo[3.3.1]nonane | CHEMBL243301
TypeSmall organic molecule
Emp. Form.C22H27NO2
Mol. Mass.337.4553
SMILESO[C@H]1[C@@H]2CCC[C@]1(CCN2CCc1ccccc1)c1cccc(O)c1