Reaction Details
TargetMu-type opioid receptor
LigandBDBM50217955
Substrate/Competitorn/a
Meas. Tech.ChEMBL_444756 (CHEMBL895003)
Ki 33±n/a nM
Citation Hiebel, ACLee, YSBilsky, EGiuvelis, DDeschamps, JRParrish, DAAceto, MDMay, ELHarris, LSCoop, ADersch, CMPartilla, JSRothman, RBCheng, KJacobson, AERice, KC Probes for narcotic receptor mediated phenomena. 34. Synthesis and structure-activity relationships of a potent mu-agonist delta-antagonist and an exceedingly potent antinociceptive in the enantiomeric C9-substituted 5-(3-hydroxyphenyl)-N-phenylethylmorphan series. J Med Chem50:3765-76 (2007) 
 
Mu-type opioid receptor
Name:Mu-type opioid receptor
Type:G Protein-Coupled Receptor (GPCR)
Mol. Mass.:44789.51
Organism:Homo sapiens (Human)
Description:P35372
Residue:400
BDBM50217955
NameBDBM50217955
Synonyms:(1R,5R)-(+)-5-(3-hydroxyphenyl)-9-oxo-2-phenylethyl-2-azabicyclo[3.3.1]nonane | CHEMBL243091
TypeSmall organic molecule
Emp. Form.C22H25NO2
Mol. Mass.335.4394
SMILESOc1cccc(c1)[C@@]12CCC[C@@H](N(CCc3ccccc3)CC1)C2=O