Reaction Details
TargetAlpha-2B adrenergic receptor
LigandBDBM50417350
Substrate/Competitorn/a
Meas. Tech.ChEMBL_444830 (CHEMBL895081)
EC50 5248±n/a nM
Citation Crassous, PACardinaletti, CCarrieri, ABruni, BDi Vaira, MGentili, FGhelfi, FGiannella, MParis, HPiergentili, AQuaglia, WSchaak, SVesprini, CPigini, M Alpha2-adrenoreceptors profile modulation. 3.1 (R)-(+)-m-nitrobiphenyline, a new efficient and alpha2C-subtype selective agonist. J Med Chem50:3964-8 (2007) 
 
Alpha-2B adrenergic receptor
Name:Alpha-2B adrenergic receptor
Type:Enzyme
Mol. Mass.:49964.20
Organism:Homo sapiens (Human)
Description:P18089
Residue:450
BDBM50417350
NameBDBM50417350
Synonyms:CHEMBL374584
TypeSmall organic molecule
Emp. Form.C17H18N2O2
Mol. Mass.282.337
SMILESCC(Oc1ccccc1-c1cccc(O)c1)C1=NCCN1