Reaction Details
TargetAlpha-2B adrenergic receptor
LigandBDBM50029051
Substrate/Competitorn/a
Meas. Tech.ChEMBL_444830 (CHEMBL895081)
EC50 62±n/a nM
Citation Crassous, PACardinaletti, CCarrieri, ABruni, BDi Vaira, MGentili, FGhelfi, FGiannella, MParis, HPiergentili, AQuaglia, WSchaak, SVesprini, CPigini, M Alpha2-adrenoreceptors profile modulation. 3.1 (R)-(+)-m-nitrobiphenyline, a new efficient and alpha2C-subtype selective agonist. J Med Chem50:3964-8 (2007) 
 
Alpha-2B adrenergic receptor
Name:Alpha-2B adrenergic receptor
Type:Enzyme
Mol. Mass.:49964.20
Organism:Homo sapiens (Human)
Description:P18089
Residue:450
BDBM50029051
NameBDBM50029051
Synonyms:(-)-arterenol (-)-norepinephrine (R)-4-(2-amino-1-hydroxyethyl)-1,2-benzenediol (R)-norepinephrine CHEMBL1437 | NOREPINEPHRINE
TypeSmall organic molecule
Emp. Form.C8H11NO3
Mol. Mass.169.1778
SMILESNC[C@H](O)c1ccc(O)c(O)c1