Reaction Details
TargetUrokinase-type plasminogen activator
LigandBDBM50218290
Substrate/Competitorn/a
Meas. Tech.ChEMBL_448748 (CHEMBL897895)
Ki>14000±n/a nM
Citation Qiao, JXWang, TCWang, GZCheney, DLHe, KRendina, ARXin, BLuettgen, JMKnabb, RMWexler, RRLam, PY Enantiopure five-membered cyclicdiamine derivatives as potent and selective inhibitors of factor Xa. Improving in vitro metabolic stability via core modifications. Bioorg Med Chem Lett17:5041-8 (2007) 
 
Urokinase-type plasminogen activator
Name:Urokinase-type plasminogen activator
Type:Enzyme
Mol. Mass.:48528.62
Organism:Homo sapiens (Human)
Description:P00749
Residue:431
BDBM50218290
NameBDBM50218290
Synonyms:5-chloro-N-((1R,2S,4S)-4-(hydroxymethyl)-2-(4-(2-oxopyridin-1(2H)-yl)benzamido)cyclopentyl)thiophene-2-carboxamide | CHEMBL237065
TypeSmall organic molecule
Emp. Form.C23H22ClN3O4S
Mol. Mass.471.956
SMILESOC[C@@H]1C[C@@H](NC(=O)c2ccc(Cl)s2)[C@H](C1)NC(=O)c1ccc(cc1)-n1ccccc1=O