Reaction Details
TargetCoagulation factor X
LigandBDBM50218305
Substrate/Competitorn/a
Meas. Tech.ChEMBL_448736 (CHEMBL897883)
Ki 0.21±n/a nM
Citation Qiao, JXWang, TCWang, GZCheney, DLHe, KRendina, ARXin, BLuettgen, JMKnabb, RMWexler, RRLam, PY Enantiopure five-membered cyclicdiamine derivatives as potent and selective inhibitors of factor Xa. Improving in vitro metabolic stability via core modifications. Bioorg Med Chem Lett17:5041-8 (2007) 
 
Coagulation factor X
Name:Coagulation factor X
Type:Enzyme
Mol. Mass.:54726.60
Organism:Homo sapiens (Human)
Description:n/a
Residue:488
BDBM50218305
NameBDBM50218305
Synonyms:3-chloro-N-((1S,2R)-2-(4-(2-oxopyridin-1(2H)-yl)benzamido)-2,3-dihydro-1H-inden-1-yl)-1H-indole-6-carboxamide | CHEMBL236228
TypeSmall organic molecule
Emp. Form.C30H23ClN4O3
Mol. Mass.522.982
SMILESClc1c[nH]c2cc(ccc12)C(=O)N[C@@H]1[C@@H](Cc2ccccc12)NC(=O)c1ccc(cc1)-n1ccccc1=O