Reaction Details
TargetCoagulation factor VII
LigandBDBM50218283
Substrate/Competitorn/a
Meas. Tech.ChEMBL_448740 (CHEMBL897888)
Ki>11000±n/a nM
Citation Qiao, JXWang, TCWang, GZCheney, DLHe, KRendina, ARXin, BLuettgen, JMKnabb, RMWexler, RRLam, PY Enantiopure five-membered cyclicdiamine derivatives as potent and selective inhibitors of factor Xa. Improving in vitro metabolic stability via core modifications. Bioorg Med Chem Lett17:5041-8 (2007) 
 
Coagulation factor VII
Name:Coagulation factor VII
Type:Enzyme
Mol. Mass.:51599.89
Organism:Homo sapiens (Human)
Description:n/a
Residue:466
BDBM50218283
NameBDBM50218283
Synonyms:5-chloro-N-((3R,4S)-1-(ethylsulfonyl)-4-(4-(2-oxopyridin-1(2H)-yl)benzamido)pyrrolidin-3-yl)thiophene-2-carboxamide | CHEMBL392297
TypeSmall organic molecule
Emp. Form.C23H23ClN4O5S2
Mol. Mass.535.036
SMILESCCS(=O)(=O)N1C[C@@H](NC(=O)c2ccc(Cl)s2)[C@H](C1)NC(=O)c1ccc(cc1)-n1ccccc1=O