Reaction Details
TargetPlasma kallikrein
LigandBDBM50218290
Substrate/Competitorn/a
Meas. Tech.ChEMBL_448742 (CHEMBL897890)
Ki>10800±n/a nM
Citation Qiao, JXWang, TCWang, GZCheney, DLHe, KRendina, ARXin, BLuettgen, JMKnabb, RMWexler, RRLam, PY Enantiopure five-membered cyclicdiamine derivatives as potent and selective inhibitors of factor Xa. Improving in vitro metabolic stability via core modifications. Bioorg Med Chem Lett17:5041-8 (2007) 
 
Plasma kallikrein
Name:Plasma kallikrein
Type:Protein
Mol. Mass.:71391.16
Organism:Homo sapiens (Human)
Description:P03952
Residue:638
BDBM50218290
NameBDBM50218290
Synonyms:5-chloro-N-((1R,2S,4S)-4-(hydroxymethyl)-2-(4-(2-oxopyridin-1(2H)-yl)benzamido)cyclopentyl)thiophene-2-carboxamide | CHEMBL237065
TypeSmall organic molecule
Emp. Form.C23H22ClN3O4S
Mol. Mass.471.956
SMILESOC[C@@H]1C[C@@H](NC(=O)c2ccc(Cl)s2)[C@H](C1)NC(=O)c1ccc(cc1)-n1ccccc1=O