Reaction Details
TargetRetinoic acid receptor RXR-alpha
LigandBDBM50218454
Substrate/Competitorn/a
Meas. Tech.ChEMBL_448791 (CHEMBL897937)
IC50 570±n/a nM
Citation Sakaki, JKonishi, KKishida, MGunji, HKanazawa, TUchiyama, HFukaya, HMitani, HKimura, M Synthesis and structure-activity relationship of RXR antagonists based on the diazepinylbenzoic acid structure. Bioorg Med Chem Lett17:4808-11 (2007) 
 
Retinoic acid receptor RXR-alpha
Name:Retinoic acid receptor RXR-alpha
Type:PROTEIN
Mol. Mass.:50820.38
Organism:Homo sapiens (Human)
Description:ChEMBL_1456363
Residue:462
BDBM50218454
NameBDBM50218454
Synonyms:4-[5-ethyl-7,7,10,10-tetramethyl-2-(propane-1-sulfonylamino)-7,8,9,10-tetrahydro-5H-5,13-diaza-benzo[4,5]cyclohepta[1,2-b]naphthalen-12-yl]-benzoic acid | CHEMBL391309
TypeSmall organic molecule
Emp. Form.C33H39N3O4S
Mol. Mass.573.745
SMILESCCCS(=O)(=O)Nc1ccc2N(CC)c3cc4c(cc3C(=Nc2c1)c1ccc(cc1)C(O)=O)C(C)(C)CCC4(C)C