Reaction Details
TargetRetinoic acid receptor RXR-alpha
LigandBDBM50218477
Substrate/Competitorn/a
Meas. Tech.ChEMBL_448792 (CHEMBL897938)
IC50 4200±n/a nM
Citation Sakaki, JKonishi, KKishida, MGunji, HKanazawa, TUchiyama, HFukaya, HMitani, HKimura, M Synthesis and structure-activity relationship of RXR antagonists based on the diazepinylbenzoic acid structure. Bioorg Med Chem Lett17:4808-11 (2007) 
 
Retinoic acid receptor RXR-alpha
Name:Retinoic acid receptor RXR-alpha
Type:PROTEIN
Mol. Mass.:50820.38
Organism:Homo sapiens (Human)
Description:ChEMBL_1456363
Residue:462
BDBM50218477
NameBDBM50218477
Synonyms:4-[5,7,7,10,10-pentamethyl-2-(3-trifluoromethyl-benzoylamino)-7,8,9,10-tetrahydro-5H-5,13-diaza-benzo[4,5]cyclohepta[1,2-b]naphthalen-12-yl]-benzoic acid | CHEMBL236919
TypeSmall organic molecule
Emp. Form.C37H34F3N3O3
Mol. Mass.625.6794
SMILESCN1c2ccc(NC(=O)c3cccc(c3)C(F)(F)F)cc2N=C(c2ccc(cc2)C(O)=O)c2cc3c(cc12)C(C)(C)CCC3(C)C