Reaction Details
TargetRetinoic acid receptor RXR-alpha
LigandBDBM50218468
Substrate/Competitorn/a
Meas. Tech.ChEMBL_448792 (CHEMBL897938)
IC50 190±n/a nM
Citation Sakaki, JKonishi, KKishida, MGunji, HKanazawa, TUchiyama, HFukaya, HMitani, HKimura, M Synthesis and structure-activity relationship of RXR antagonists based on the diazepinylbenzoic acid structure. Bioorg Med Chem Lett17:4808-11 (2007) 
 
Retinoic acid receptor RXR-alpha
Name:Retinoic acid receptor RXR-alpha
Type:PROTEIN
Mol. Mass.:50820.38
Organism:Homo sapiens (Human)
Description:ChEMBL_1456363
Residue:462
BDBM50218468
NameBDBM50218468
Synonyms:4-[2-(4-fluoro-benzenesulfonylamino)-5,7,7,10,10-pentamethyl-7,8,9,10-tetrahydro-5H-5,13-diaza-benzo[4,5]cyclohepta[1,2-b]naphthalen-12-yl]-benzoic acid | CHEMBL235204
TypeSmall organic molecule
Emp. Form.C35H34FN3O4S
Mol. Mass.611.726
SMILESCN1c2ccc(NS(=O)(=O)c3ccc(F)cc3)cc2N=C(c2ccc(cc2)C(O)=O)c2cc3c(cc12)C(C)(C)CCC3(C)C