Reaction Details
TargetRetinoic acid receptor RXR-alpha
LigandBDBM50218469
Substrate/Competitorn/a
Meas. Tech.ChEMBL_448792 (CHEMBL897938)
IC50 370±n/a nM
Citation Sakaki, JKonishi, KKishida, MGunji, HKanazawa, TUchiyama, HFukaya, HMitani, HKimura, M Synthesis and structure-activity relationship of RXR antagonists based on the diazepinylbenzoic acid structure. Bioorg Med Chem Lett17:4808-11 (2007) 
 
Retinoic acid receptor RXR-alpha
Name:Retinoic acid receptor RXR-alpha
Type:PROTEIN
Mol. Mass.:50820.38
Organism:Homo sapiens (Human)
Description:ChEMBL_1456363
Residue:462
BDBM50218469
NameBDBM50218469
Synonyms:4-[2-(butane-1-sulfonylamino)-5,7,7,10,10-pentamethyl-7,8,9,10-tetrahydro-5H-5,13-diaza-benzo[4,5]cyclohepta[1,2-b]naphthalen-12-yl]-benzoic acid | CHEMBL391112
TypeSmall organic molecule
Emp. Form.C33H39N3O4S
Mol. Mass.573.745
SMILESCCCCS(=O)(=O)Nc1ccc2N(C)c3cc4c(cc3C(=Nc2c1)c1ccc(cc1)C(O)=O)C(C)(C)CCC4(C)C