Reaction Details
TargetMitogen-activated protein kinase 9
LigandBDBM50218682
Substrate/Competitorn/a
Meas. Tech.ChEMBL_444955 (CHEMBL894103)
IC50 16±n/a nM
Citation Goldberg, DRHao, MHQian, KCSwinamer, ADGao, DAXiong, ZSarko, CBerry, ALord, JMagolda, RLFadra, TKroe, RRKukulka, AMadwed, JBMartin, LPargellis, CSkow, DSong, JJTan, ZTorcellini, CAZimmitti, CSYee, NKMoss, N Discovery and optimization of p38 inhibitors via computer-assisted drug design. J Med Chem50:4016-26 (2007) 
 
Mitogen-activated protein kinase 9
Name:Mitogen-activated protein kinase 9
Type:Enzyme
Mol. Mass.:48131.49
Organism:Homo sapiens (Human)
Description:JNK-2 was purchased from Upstate Cell Signaling Solutions (formerly Upstate Biotechnology).
Residue:424
BDBM50218682
NameBDBM50218682
Synonyms:CHEMBL243575 | N-[2-(5-tert-butyl-3-methanesulfonylamino-2-methoxy-phenylcarbamoyl)-benzo[b]thiophen-7-yl]-6-cyclopropylamino-nicotinamide
TypeSmall organic molecule
Emp. Form.C30H33N5O5S2
Mol. Mass.607.744
SMILESCOc1c(NC(=O)c2cc3cccc(NC(=O)c4ccc(NC5CC5)nc4)c3s2)cc(cc1NS(C)(=O)=O)C(C)(C)C