Reaction Details
TargetTyrosine-protein kinase Lyn
LigandBDBM50218682
Substrate/Competitorn/a
Meas. Tech.ChEMBL_444954 (CHEMBL894104)
IC50 230±n/a nM
Citation Goldberg, DRHao, MHQian, KCSwinamer, ADGao, DAXiong, ZSarko, CBerry, ALord, JMagolda, RLFadra, TKroe, RRKukulka, AMadwed, JBMartin, LPargellis, CSkow, DSong, JJTan, ZTorcellini, CAZimmitti, CSYee, NKMoss, N Discovery and optimization of p38 inhibitors via computer-assisted drug design. J Med Chem50:4016-26 (2007) 
 
Tyrosine-protein kinase Lyn
Name:Tyrosine-protein kinase Lyn
Type:Protein
Mol. Mass.:58575.92
Organism:Homo sapiens (Human)
Description:P07948
Residue:512
BDBM50218682
NameBDBM50218682
Synonyms:CHEMBL243575 | N-[2-(5-tert-butyl-3-methanesulfonylamino-2-methoxy-phenylcarbamoyl)-benzo[b]thiophen-7-yl]-6-cyclopropylamino-nicotinamide
TypeSmall organic molecule
Emp. Form.C30H33N5O5S2
Mol. Mass.607.744
SMILESCOc1c(NC(=O)c2cc3cccc(NC(=O)c4ccc(NC5CC5)nc4)c3s2)cc(cc1NS(C)(=O)=O)C(C)(C)C